{"text_format":"1","workbook":"xlsx","n_sheets":7,"sheets":["Tdata","%data","PTool","TTOOL","Lists","Repgen","Repgen2"],"not_rendered":{"charts":0,"images":0,"macros":1,"external_links":0,"defined_names":20,"comments":0,"pivot_tables":0},"unopened":[],"bounds":{"document_bytes":16777216,"sheet_cells":100000,"rows_first":2000,"rows_last":500,"rows_between":2000,"halvings":0,"cell_chars":16384,"cell_head_chars":4096},"cells_cut":0,"cells_raw":0,"read":"whole","date_system":"1900"}

{"sheet":"Tdata","index":0,"n_rows":306,"n_cols":17,"rows_kept":306,"cut":false,"hidden":false,"merged":[[0,0,0,16]]}
[]
[]
[]
[]
[]
["Rertofit level","Rerofit category","Building type","Age","SPECS","Number of dwellings","Total Energy Demand before retrofit (TWh/a) ","Total Electric Energy  demand after retrofit Twh/a","Total Energy Demand  after retrofit (TWh/a) ","Total Energy Demand  Reducton (TWh/a) ","Total CO2 emissions Before retrofit (MTCO2)","Total CO2 Emissions per annum (MTCo2/a)","Total CO2 emissions reducton (MTCO2)","Total Upgrade capital Cost (Bil £)","Total Original running cost (Bil £/a)","Total Running Cost after retrofit (Bil £/a)","Total running cost savings (Bil £/a)"]
["A1","Renewables","detached","Pre-1919","No Fabric+ ASHP + Solar Thermal ",102303.28000000001,7.0922017406110003,null,2.2798925343500001,4.8123092062610002,1.9198415113122003,0.96212398467000015,0.95771752664220011,0.43223135800000001,0.31589938266851997,0.23310569622600005,8.2793686442519998E-2]
["A1","Renewables","detached","1919-1982","No Fabric+ ASHP + Solar Thermal ",204606.56,5.1371924537660005,null,1.971895722,3.1652967317660003,1.2870353962679839,0.83244178936000002,0.45459360690798395,0.87367001119999987,0.22835647105856,0.2074894664304,2.0867004628159984E-2]
["A1","Renewables","detached","Post-1982","No Fabric+ ASHP + Solar Thermal ",230182.37999999998,5.1144525932212082,null,1.8770038031195999,3.2374487901016078,1.3154692259164051,0.79178135072400002,0.52368787519240512,0.9863314983,0.24273467403704102,0.19912962602609999,4.3605048010941019E-2]
["A1","Renewables","detached","ALL","No Fabric+ ASHP + Solar Thermal ",537092.22,17.343846787598206,null,6.1287920594695997,11.215054728128608,4.5223461334965895,2.5863471247540004,1.9359990087425891,2.2922328675000001,0.78699052776412104,0.63972478868250016,0.14726573908162099]
["A1","Renewables","semi-detached","Pre-1919","No Fabric+ ASHP + Solar Thermal ",51151.64,2.9476999058781601,null,0.969468081383,1.97823182449516,0.68923503649445006,0.40905582870700002,0.28017920778745004,0.21611567900000003,0.10743190966923,9.9491218591000005E-2,7.9406910782299986E-3]
["A1","Renewables","semi-detached","1919-1982","No Fabric+ ASHP + Solar Thermal ",358061.48000000004,9.3115083441281712,null,2.4401854055852001,6.8713229385429715,3.2917258208814277,1.0299817502940001,2.2617440705874277,1.5289225196000003,0.54292171153743596,0.26197926245679998,0.28094244908063609]
["A1","Renewables","semi-detached","Post-1982","No Fabric+ ASHP + Solar Thermal ",102303.27999999998,1.5066337039863997,null,0.52634219133759996,0.98029151264879999,0.37791453124425989,0.22203034313319994,0.15588418811105997,0.43836955479999995,7.4944646315259988E-2,5.7726160289199996E-2,1.721848602606E-2]
["A1","Renewables","semi-detached","ALL","No Fabric+ ASHP + Solar Thermal ",511516.4,13.765841953992732,null,3.9359956783058001,9.8298462756869327,4.3588753886201381,1.6610679221342002,2.6978074664859375,2.1834077534,0.72529826752192594,0.41919664133700002,0.30610162618492609]
["A1","Renewables","mid-terrace","Pre-1919","No Fabric+ ASHP + Solar Thermal ",76727.459999999992,3.4056996570148494,null,1.136836247463,2.2688634095518494,0.80169338764410003,0.47962910701950001,0.32206428062460002,0.5630596697437501,0.129523337498025,0.11749084131149999,1.2032496186525004E-2]
["A1","Renewables","mid-terrace","1919-1982","No Fabric+ ASHP + Solar Thermal ",383637.30000000005,6.15312547007355,null,2.3569908437399998,3.7961346263335498,1.4913181484837099,0.99446460906000012,0.49685353942370991,1.638131271,0.28345763148624004,0.25484642201700003,2.8611209469239986E-2]
["A1","Renewables","mid-terrace","Post-1982","No Fabric+ ASHP + Solar Thermal ",102303.28,1.404178227396744,null,0.52362808531920002,0.88055014207754412,0.36331308588453604,0.22104772012880003,0.14226536575573598,0.43836955480000001,7.3545362512075996E-2,5.74980239748E-2,1.6047338537276003E-2]
["A1","Renewables","mid-terrace","ALL","No Fabric+ ASHP + Solar Thermal ",562668.04,10.963003354485142,null,4.0174551765222004,6.9455481779629427,2.6563246220123462,1.6951414362083002,0.96118318580404583,2.6395604955437504,0.486526331496341,0.42983528730330001,5.6691044193040996E-2]
["A1","Renewables","flat(m)","Pre-1919","No Fabric+ ASHP + Solar Thermal ",281334.02,4.4509060535593505,null,1.5272217275700002,2.9236843259893504,1.10198774767917,0.64427600585150002,0.45771174182766999,1.2659890232990001,0.21359575100099498,0.16673260695300002,4.6863144047995006E-2]
["A1","Renewables","flat(m)","1919-1982","No Fabric+ ASHP + Solar Thermal ",481081.17420000007,4.9046216962759566,null,1.7126682233989683,3.1919534728769889,1.2683276558191441,0.72316603186918205,0.54516162394996204,2.0542166138340003,0.26616938485354802,0.19543441620700799,7.0734968646540011E-2]
["A1","Renewables","flat(m)","Post-1982","No Fabric+ ASHP + Solar Thermal ",179030.73999999996,1.4654232969838208,null,0.63447867648409983,0.83094462049972084,0.45304881714965595,0.26774405228479997,0.185304764864856,0.76714672089999991,0.10569654424575399,7.2400031255999989E-2,3.3296512989753994E-2]
["A1","Renewables","flat(m)","ALL","No Fabric+ ASHP + Solar Thermal ",941445.93420000002,10.820951046819131,null,3.8743686274530682,6.9465824193660595,2.8233642206479699,1.635186090005482,1.1881781306424881,4.0873523580329998,0.58546168010029698,0.43456705441600801,0.15089462568428902]
["A1","Renewables","ALL","ALL","No Fabric+ ASHP + Solar Thermal ",2552722.5942000002,52.893643142895208,null,17.956611541750668,34.937031601144547,14.360910364777045,7.5777425731019825,6.7831677916750612,11.202553474476751,2.5842768068826847,1.9233237717388081,0.66095303514387715]
["A2","Renewables","detached","Pre-1919","No Fabric + ASHP + Solar PV ",102303.28000000001,7.0922017406110003,null,2.2984094280300003,4.7937923125810009,1.9198415113122005,0.96029275595800023,0.95954875535420014,0.841444478,0.31589938266851997,0.234995749324,8.0903633344519998E-2]
["A2","Renewables","detached","1919-1982","No Fabric + ASHP + Solar PV ",204606.56,5.1371924537660005,null,2.0100036937999994,3.1271887599659998,1.2870353962679841,0.82855426472000004,0.45848113154798398,1.6920962511999997,0.22835647105856,0.2112133058224,1.7143165236160003E-2]
["A2","Renewables","detached","Post-1982","No Fabric + ASHP + Solar PV ",230182.37999999998,5.1144525932212082,null,1.9182985220915998,3.1961540711296084,1.3154692259164049,0.78754714584389995,0.52792208007250507,1.9070610182999999,0.24273467403704102,0.2033649818181,3.9369692218940995E-2]
["A2","Renewables","detached","ALL","No Fabric + ASHP + Solar PV ",537092.22,17.343846787598206,null,6.2267116439215995,11.117135143676609,4.5223461334965895,2.5763941665219003,1.9459519669746892,4.4406017474999997,0.78699052776412104,0.6495740369645,0.13741649079962101]
["A2","Renewables","semi-detached","Pre-1919","No Fabric + ASHP + Solar PV ",51151.64,2.9476999058781601,null,0.97863957043500016,1.9690603354431602,0.68923503649444995,0.40814021435099995,0.28109482214345005,0.42072223900000005,0.10743190966923,0.10043240876700001,6.9995009022300056E-3]
["A2","Renewables","semi-detached","1919-1982","No Fabric + ASHP + Solar PV ",358061.48000000004,9.3115083441281712,null,2.5017683995304001,6.8097399445977711,3.2917258208814282,1.0212772757152,2.2704485451662282,2.9611684396000002,0.54292171153743596,0.26803408208360002,0.27488762945383605]
["A2","Renewables","semi-detached","Post-1982","No Fabric + ASHP + Solar PV ",102303.27999999998,1.5066337039863997,null,0.54344729975360007,0.9631864042328,0.37791453124426,0.21944258166560002,0.15847194957865995,0.84758267479999994,7.4944646315259988E-2,5.9434625065199989E-2,1.5510021250060011E-2]
["A2","Renewables","semi-detached","ALL","No Fabric + ASHP + Solar PV ",511516.4,13.765841953992732,null,4.0238552697190002,9.7419866842737317,4.3588753886201381,1.6488600717318,2.7100153168883381,4.2294733534000004,0.72529826752192594,0.42790111591579999,0.29739715160612606]
["A2","Renewables","mid-terrace","Pre-1919","No Fabric + ASHP + Solar PV ",76727.459999999992,3.4056996570148494,null,1.1507641996395002,2.2549354573753497,0.80169338764410003,0.47821732175550002,0.32347606588860001,0.86996950974374998,0.129523337498025,0.11890262657549999,1.0620710922524996E-2]
["A2","Renewables","mid-terrace","1919-1982","No Fabric + ASHP + Solar PV ",383637.30000000005,6.15312547007355,null,2.4189482676900003,3.7341772023835498,1.4913181484837099,0.98441331180000002,0.50690483668370989,3.1726804710000001,0.28345763148624004,0.26114191011000004,2.2315721376240012E-2]
["A2","Renewables","mid-terrace","Post-1982","No Fabric + ASHP + Solar PV ",102303.28,1.404178227396744,null,0.54088204500759995,0.86329618238914385,0.36331308588453604,0.21850036845680001,0.14481271742773599,0.84758267480000005,7.3545362512075996E-2,5.9216719078800002E-2,1.4328643433275999E-2]
["A2","Renewables","mid-terrace","ALL","No Fabric + ASHP + Solar PV ",562668.04,10.963003354485142,null,4.1105945123371006,6.8524088421480434,2.6563246220123462,1.6811310020123,0.97519362000004595,4.8902326555437501,0.486526331496341,0.43926125576430003,4.7265075732041008E-2]
["A2","Renewables","flat(m)","Pre-1919","No Fabric + ASHP + Solar PV ",281334.02,4.4509060535593505,null,1.5685778285100003,2.8823282250493505,1.10198774767917,0.63479504937750009,0.46719269830166998,2.3913251032990002,0.21359575100099498,0.17088931709849997,4.2706433902495011E-2]
["A2","Renewables","flat(m)","1919-1982","No Fabric + ASHP + Solar PV ",481081.17420000007,4.9046216962759566,null,1.7779894252318442,3.1266322710441128,1.2683276558191441,0.70411040655912005,0.56421724926002415,3.9785413106340006,0.26616938485354802,0.20183279582386804,6.4336589029680008E-2]
["A2","Renewables","flat(m)","Post-1982","No Fabric + ASHP + Solar PV ",179030.73999999996,1.4654232969838208,null,0.66117215981809996,0.80425113716572072,0.45304881714965595,0.26183603786479998,0.191212779284856,1.4832696808999997,0.10569654424575399,7.5066694128299999E-2,3.0629850117453991E-2]
["A2","Renewables","flat(m)","ALL","No Fabric + ASHP + Solar PV ",941445.93420000002,10.820951046819131,null,4.0077394135599445,6.8132116332591837,2.8233642206479703,1.6007414938014202,1.2226227268465502,7.8531360948330002,0.58546168010029698,0.44778880705066804,0.13767287304962902]
["A2","Renewables","ALL","ALL","No Fabric + ASHP + Solar PV ",2552722.5942000002,52.893643142895208,null,18.368900839537641,34.524742303357563,14.360910364777045,7.5071267340674206,6.853783630709624,21.41344385127675,2.5842768068826847,1.9645252156952682,0.61975159118741707]
{"$rows_left_out":267}
{"sheet":"%data","index":1,"n_rows":17,"n_cols":18,"rows_kept":17,"cut":false,"hidden":false,"merged":[]}
[null,null,"Percentage","Total Energy Demand before retrofit (MWh/a) ","Total Electric Energy  demand after retrofit mwh/a","Total Other Energy  demand after retrofit mwh/a","Total Renewable Energy Generation after retrofit mwh/a","Total Energy Demand  after retrofit (MWh/a) ","Total Demand reduction per 30 years (MWh)","Total CO2 Emissions per annum (TCo2/a)","Total Upgrade capital Cost (£)","Total Original running cost (£/a)","Total Running Cost after retrofit (£/a)","Total running cost savings (£/a)","Total Running cost savings per 30 years","Total Retrofit Cost savings per 30 years (£)","Total capital cost / carbon saving * 30) (£/TCO2)","Total capital COST / energy saving *30 (£/MWh)"]
["A1","Renewables",100,5289364314.2895241,1795661154.1750669,0,0,1795661154.1750669,104811094803.43364,757774257.31019819,1120255347447.675,258427680688.26846,192332377173.88083,66095303514.387718,1859254773562.2512,-862603757983.95593,5505.0746291064652,106.88327886934501]
["A2","Renewables",100,528936431.42895234,183689008.39537644,0,16745860.217952,183689008.39537644,10357422691.007269,75071267.340674207,214134438512.76749,25842768068.826847,19645252156.952682,6197515911.8741703,185925477356.22513,28208961156.542389,1041.4414871677561,20.674490643187479]
["A3","Renewables",100,5289364314.2895241,1632759344.6933069,0,165556006.69939199,1632759344.6933069,109698149087.88643,664750510.39075541,2516653993529.1147,258427680688.26846,176016051087.95157,82411629600.316895,2472348888009.5068,44305105519.608215,10875.672107692966,229.41626768131326]
["B","GOV",100,5289364314.2895241,1727265912.1822505,0,0,1945245441.8526604,100323566173.10582,771162770.68521321,1552041979534.3303,258427680688.26846,191666502771.67661,66761177916.591904,2002835337497.7573,-450793357963.42688,7780.4983353331463,154.70362934032082]
["C1","AECB Silver",100,5289364314.2895241,737646828.41322017,2490940891.9904089,0,3228587720.4036288,62485711375.546051,794283272.83420873,2556837648240.1914,258427680688.26846,160236588318.43338,98191092369.835083,2945732771095.0527,-388895122854.86169,13279.353481823542,409.1875713590448]
["C2","AECB Silver",100,5289364314.2895241,1804762538.3698978,0,0,1804762538.3698978,105200466836.55795,761691613.58664632,2729162791873.4912,258427680688.26846,193257766864.04297,65169913824.225494,1955097414726.7654,774065377146.7262,13489.349186045385,259.42496967371682]
["C3","AECB Silver",100,5289364314.2895241,1571552405.3289933,0,0,1571552405.3289933,112196770827.78508,663122186.4236927,3298864182373.4917,258427680688.26846,169897639998.06177,88530040690.206726,2655901220706.2012,642962961667.29041,14225.947061743313,294.02487772460393]
["C4","AECB Silv. + Renewables",100,5289364314.2895241,1596174408.8821757,0,0,1596174408.8821757,111458110721.18962,673616834.89671206,3070983626173.4912,258427680688.26846,172388772692.84521,86038907995.423294,2581167239862.6992,489816386310.79224,13425.519271365949,275.52805321234092]
["C5","AECB Silv. + Renewables",100,5289364314.2895241,1637515599.1191154,0,167458602.17951998,1637515599.1191156,110217875014.08144,666576185.05768406,3982505850973.4907,258427680688.26846,176511906646.09097,81915774042.177505,2457473221265.3252,1525032629708.1663,17251.154384802296,361.33030603835221]
["C6","AECB Silv. + Renewables",100,5289364314.2895241,1429260684.2022636,0,167458602.17951998,1429260684.2022636,116465522461.58698,578502032.97534013,4324326685273.4917,258427680688.26846,155642912474.89322,102784768213.37529,3083543046401.2598,1240783638872.2324,16808.077325358609,371.29672317399786]
["D1","AECB Gold",100,5289364314.2895241,732796371.59263813,1091956066.4337146,29361.041359999996,1824752438.0263522,104600769846.8643,521381468.20546091,3732683471169.2373,258427680688.26846,124899803419.18399,133527877269.0845,4005836318072.5356,-273152846903.2977,13602.435864678328,356.85047792993248]
["D2","AECB Gold",100,5289364314.2895241,1223024120.4153433,0,0,1223024120.4153435,122652619375.1946,516232122.12203109,3887335723182.5371,258427680688.26846,135093055431.72099,123334625256.5475,3700038757696.4248,187296965486.11203,14086.709974451069,316.93866327397149]
["D3","AECB Gold",100,5289364314.2895241,1116104950.1818256,0,0,1116104950.1818256,125860194482.20012,471014020.95463288,4457037113682.5381,258427680688.26846,124378991998.92139,134048688689.34711,4021460660680.4141,435576453002.12415,15394.409088573528,354.12603103142953]
["D4","AECB Gold + Ren",100,5289364314.2895241,1055737179.047532,0,167458602.17951998,1055737179.047532,127671227616.22894,421068052.73131847,5142589296036.5371,258427680688.26846,118335911673.5014,140091769014.76712,4202753070443.0132,939836225593.52417,16888.25237912533,402.79939278839026]
["Original","Pre-retrofit",-1210,-64001308202.903236,-13499382844.843554,-56914088608.882095,0,-70413471453.725632,0,-17376701541.380222,0,-3126974936328.0483,-3126974936328.0483,0,0,0,0,0]
[null,null,"Sum",52893643.142895125,47445676.601554543,-533311916.50457972,6847070.3449726403,-483686444.60632098,14239995013.126682,-90404549.458656535,425854121480.02393,2584276806.8826904,-10166714036.198912,12750990843.081602,381293681973.75439,43324396187.575752,1736.5389457726769,39.13184732739947]

{"sheet":"PTool","index":2,"n_rows":31,"n_cols":17,"rows_kept":31,"cut":false,"hidden":false,"merged":[]}
["Retrofit","Specs","Percentage","Total Electric Energy  demand after retrofit Twh/a","Total Energy Demand  after retrofit (TWh/a) ","Total Energy Demand  Reducton (TWh/a) ","Total CO2 Emissions per annum (MTCo2/a)","Total CO2 emissions reducton (MTCO2)","Total Upgrade capital Cost (Bil £)","Total Running Cost after retrofit (Bil £/a)","Total running cost savings (Bil £/a)"]
["A1","Renewables",0,null,17.956611541750668,34.937031601144547,7.5777425731019825,6.7831677916750612,11.202553474476749,1.9233237717388083,0.66095303514387715,null,null,null,null,null,"0"]
["A2","Renewables",0,null,18.368900839537641,34.524742303357563,7.5071267340674206,6.853783630709624,21.41344385127675,1.9645252156952682,0.61975159118741707]
["A3","Renewables",0,null,16.327593446933069,36.566049695962143,6.6475051039075543,7.7134052608694903,25.166539935291144,1.7601605108795157,0.82411629600316894,null,null,null,null,null,"10"]
["B","GOV",0,null,19.452454418526603,33.441188724368615,7.7116277068521315,6.6492826579249114,15.520419795343305,1.9166650277167661,0.66761177916591907,null,null,null,null,null,"40"]
["C1","AECB Silver",0,null,32.166476769700303,20.727166373194912,7.9428327283420872,6.4180776364349583,25.568376482401913,1.6023658831843337,0.98191092369835087]
["C2","AECB Silver",0,null,17.982624871957917,34.911018270937298,7.6169161358664628,6.743994228910581,27.291627918734914,1.9325776686404297,0.651699138242255]
["C3","AECB Silver",0,null,15.659234103172833,37.234409039722372,6.6312218642369265,7.7296885005401181,32.988641823734916,1.6989763999806178,0.88530040690206724]
["C4","AECB Silv. + Renewables",0,null,15.903974986730777,36.989668156164448,6.7361683489671211,7.6247420158099199,30.709836261734914,1.723887726928452,0.86038907995423297]
["C5","AECB Silv. + Renewables",0,null,16.315825562016634,36.57781758087858,6.6657618505768399,7.6951485142002021,39.825058509734909,1.7651190664609098,0.81915774042177503]
["C6","AECB Silv. + Renewables",0,null,14.240507822498197,38.65313532039702,5.7850203297534017,8.575890035023642,43.243266852734919,1.5564291247489321,1.027847682133753,null,null,null,null,null,"10"]
["D1","AECB Gold",0,null,18.178825988587764,34.714817154307447,5.2138146820546094,9.1470956827224317,37.326834711692378,1.2489980341918399,1.3352787726908451]
["D2","AECB Gold",0,null,12.186195345375674,40.707447797519542,5.1623212212203109,9.1985891435567346,38.873357231825374,1.3509305543172099,1.233346252565475]
["D3","AECB Gold",0,null,11.121194573633156,41.77244856926206,4.7101402095463287,9.650770155230715,44.570371136825379,1.243789919989214,1.340486886893471]
["D4","AECB Gold + Ren",0,null,10.51907818937376,42.374564953521443,4.2106805273131851,10.150229837463858,51.425892960365374,1.1833591167350139,1.4009176901476712,null,null,null,null,null,"30"]
["Original","Pre-retrofit",{"$f":"100-(SUM(C2:C15))","v":100},null,52.893643142895208,0,14.360910364777043,null,0,2.5842768068826847,0]
[null,null,"Sum",{"$f":"((D2*C2)+(D3*C3)+(D4*C4)+(D5*C5)+(D6*C6)+(D7*C7)+(D8*C8)+(D9*C9)+(D10*C10)+(D11*C11)+(D12*C12)+(D13*C13)+(D14*C14)+(D15*C15)+(D16*C16))/100","v":0},{"$f":"((E2*C2)+(E3*C3)+(E4*C4)+(E5*C5)+(E6*C6)+(E7*C7)+(E8*C8)+(E9*C9)+(E10*C10)+(E11*C11)+(E12*C12)+(E13*C13)+(E14*C14)+(E15*C15)+(E16*C16))/100","v":52.893643142895208},{"$f":"((F2*C2)+(F3*C3)+(F4*C4)+(F5*C5)+(F6*C6)+(F7*C7)+(F8*C8)+(F9*C9)+(F10*C10)+(F11*C11)+(F12*C12)+(F13*C13)+(F14*C14)+(F15*C15)+(F16*C16))/100","v":0},{"$f":"((G2*C2)+(G3*C3)+(G4*C4)+(G5*C5)+(G6*C6)+(G7*C7)+(G8*C8)+(G9*C9)+(G10*C10)+(G11*C11)+(G12*C12)+(G13*C13)+(G14*C14)+(G15*C15)+(G16*C16))/100","v":14.360910364777045},{"$f":"((H2*C2)+(H3*C3)+(H4*C4)+(H5*C5)+(H6*C6)+(H7*C7)+(H8*C8)+(H9*C9)+(H10*C10)+(H11*C11)+(H12*C12)+(H13*C13)+(H14*C14)+(H15*C15)+(H16*C16))/100","v":0},{"$f":"((I2*C2)+(I3*C3)+(I4*C4)+(I5*C5)+(I6*C6)+(I7*C7)+(I8*C8)+(I9*C9)+(I10*C10)+(I11*C11)+(I12*C12)+(I13*C13)+(I14*C14)+(I15*C15)+(I16*C16))/100","v":0},{"$f":"((J2*C2)+(J3*C3)+(J4*C4)+(J5*C5)+(J6*C6)+(J7*C7)+(J8*C8)+(J9*C9)+(J10*C10)+(J11*C11)+(J12*C12)+(J13*C13)+(J14*C14)+(J15*C15)+(J16*C16))/100","v":2.5842768068826847},{"$f":"((K2*C2)+(K3*C3)+(K4*C4)+(K5*C5)+(K6*C6)+(K7*C7)+(K8*C8)+(K9*C9)+(K10*C10)+(K11*C11)+(K12*C12)+(K13*C13)+(K14*C14)+(K15*C15)+(K16*C16))/100","v":0}]
[]
[]
[]
[]
["Combined","Combined","Sum",0,23.033802260914566,29.859840881980645,7.4256992547315948,6.9352111100454499,27.066011064886641,1.7358766935808534,0.84840011330183163]
[]
[]
[]
["R","P"]
[null,0]
[null,0]
[null,0]
[null,0]
[null,{"$f":"SUM(B27:B30)","v":0}]

{"sheet":"TTOOL","index":3,"n_rows":6,"n_cols":25,"rows_kept":6,"cut":false,"hidden":false,"merged":[]}
["Results 1"]
["Results 2"]
["Results 3"]
[null,null,null,null,null,null,null,null,null,null,null,null,null,null,null,null,null,null,null,null,null,"Rertofit level","Rerofit category","Building type","Age"]
[null,null,null,null,null,null,null,null,null,null,null,null,null,null,null,null,null,null,null,null,null,"C5",null,"ALL","Pre-1919"]
["Rertofit level","Rerofit category","Building type","Age","SPECS","Number of dwellings","Total Energy Demand before retrofit (TWh/a) ","Total Electric Energy  demand after retrofit Twh/a","Total Energy Demand  after retrofit (TWh/a) ","Total Energy Demand  Reducton (TWh/a) ","Total CO2 emissions Before retrofit (MTCO2)","Total CO2 Emissions per annum (MTCo2/a)","Total CO2 emissions reducton (MTCO2)","Total Upgrade capital Cost (Bil £)","Total Original running cost (Bil £/a)","Total Running Cost after retrofit (Bil £/a)","Total running cost savings (Bil £/a)"]

{"sheet":"Lists","index":4,"n_rows":17,"n_cols":7,"rows_kept":17,"cut":false,"hidden":false,"merged":[]}
["Rertofit level","Building type","Age","%","%table"]
["A1","detached","Pre-1919",10,0,{"$f":"E2","v":0},"None"]
["A2","semi-detached","1919-1982",20,{"$f":"IF(PTool!C16<10, \"\", 10)","v":10},{"$f":"E3","v":10},"A1"]
["A3","mid-terrace","Post-1982",30,{"$f":"IF(PTool!C16<20, \"\", 20)","v":20},20,"A2"]
["B","flat(m)","ALL",40,{"$f":"IF(PTool!C16<30, \"\", 30)","v":30},30,"A3"]
["C1","ALL",null,50,{"$f":"IF(PTool!C16<40, \"\", 40)","v":40},40,"B"]
["C2",null,null,60,{"$f":"IF(PTool!C16<50, \"\", 50)","v":50},50,"C1"]
["C3",null,null,70,{"$f":"IF(PTool!C16<60, \"\", 60)","v":60},60,"C2"]
["C4",null,null,80,{"$f":"IF(PTool!C16<70, \"\", 70)","v":70},70,"C3"]
["C5",null,null,90,{"$f":"IF(PTool!C16<80, \"\", 80)","v":80},80,"C4"]
["C6",null,0,100,{"$f":"IF(PTool!C16<90, \"\", 90)","v":90},90,"C5"]
["D1",null,null,null,{"$f":"IF(PTool!C16<100, \"\", 100)","v":100},null,"C6"]
["D2",null,null,null,null,null,"D1"]
["D3",null,null,null,null,null,"D2"]
["D4",null,null,null,null,null,"D3"]
["Original",null,null,null,null,null,"D4"]
["None"]

{"sheet":"Repgen","index":5,"n_rows":30,"n_cols":17,"rows_kept":30,"cut":false,"hidden":false,"merged":[]}
["Rertofit level","Rerofit category","Building type","Age","SPECS","Number of dwellings","Total Energy Demand before retrofit (TWh/a) ","Total Electric Energy  demand after retrofit Twh/a","Total Energy Demand  after retrofit (TWh/a) ","Total Energy Demand  Reducton (TWh/a) ","Total CO2 emissions Before retrofit (MTCO2)","Total CO2 Emissions per annum (MTCo2/a)","Total CO2 emissions reducton (MTCO2)","Total Upgrade capital Cost (Bil £)","Total Original running cost (Bil £/a)","Total Running Cost after retrofit (Bil £/a)","Total running cost savings (Bil £/a)"]
[{"$f":"TTOOL!A7","v":0},{"$f":"TTOOL!B7","v":0},{"$f":"TTOOL!C7","v":0},{"$f":"TTOOL!D7","v":0},{"$f":"TTOOL!E7","v":0},{"$f":"TTOOL!F7","v":0},{"$f":"TTOOL!G7","v":0},{"$f":"TTOOL!H7","v":0},{"$f":"TTOOL!I7","v":0},{"$f":"TTOOL!J7","v":0},{"$f":"TTOOL!K7","v":0},{"$f":"TTOOL!L7","v":0},{"$f":"TTOOL!M7","v":0},{"$f":"TTOOL!N7","v":0},{"$f":"TTOOL!O7","v":0},{"$f":"TTOOL!P7","v":0},{"$f":"TTOOL!Q7","v":0}]
[]
[]
[]
[]
[]
[]
[]
[]
[]
[]
[]
[]
[]
[]
[]
[]
[]
[]
[]
[]
[]
[]
[]
[]
["A3"]
["B"]
["C6"]
["D4"]

{"sheet":"Repgen2","index":6,"n_rows":2,"n_cols":11,"rows_kept":2,"cut":false,"hidden":false,"merged":[]}
["Retrofit","Specs","Percentage","Total Electric Energy  demand after retrofit Twh/a","Total Energy Demand  after retrofit (TWh/a) ","Total Energy Demand  Reducton (TWh/a) ","Total CO2 Emissions per annum (MTCo2/a)","Total CO2 emissions reducton (MTCO2)","Total Upgrade capital Cost (Bil £)","Total Running Cost after retrofit (Bil £/a)","Total running cost savings (Bil £/a)"]
[{"$f":"PTool!A22","v":"Combined"},{"$f":"PTool!B22","v":"Combined"},{"$f":"PTool!C22","v":"Sum"},{"$f":"PTool!D22","v":0},{"$f":"PTool!E22","v":23.033802260914566},{"$f":"PTool!F22","v":29.859840881980645},{"$f":"PTool!G22","v":7.4256992547315948},{"$f":"PTool!H22","v":6.9352111100454499},{"$f":"PTool!I22","v":27.066011064886641},{"$f":"PTool!J22","v":1.7358766935808534},{"$f":"PTool!K22","v":0.84840011330183163}]