{"text_format":"1","workbook":"xlsx","n_sheets":7,"sheets":["Welcome","Wind farm definition","Worksheet","Carbon appraisal result","Gaia Wind 133 ","Siemens  G2","E- 126"],"not_rendered":{"charts":1,"images":1,"macros":1,"external_links":0,"defined_names":0,"comments":0,"pivot_tables":0},"unopened":[],"bounds":{"document_bytes":16777216,"sheet_cells":100000,"rows_first":2000,"rows_last":500,"rows_between":2000,"halvings":0,"cell_chars":16384,"cell_head_chars":4096},"cells_cut":0,"cells_raw":0,"read":"whole","date_system":"1900"}

{"sheet":"Welcome","index":0,"n_rows":9,"n_cols":3,"rows_kept":9,"cut":false,"hidden":false,"merged":[[8,0,8,23]]}
[]
[]
[]
[null,null,"Welcome"]
[]
[]
[]
[]
["Wind farm CO2 estimator"]

{"sheet":"Wind farm definition","index":1,"n_rows":25,"n_cols":10,"rows_kept":25,"cut":false,"hidden":false,"merged":[[1,1,2,10],[5,1,5,10],[13,1,13,10],[51,5,51,6],[39,2,39,3],[15,5,15,6],[15,8,15,9]]}
[]
[null,"Wind farm definition"]
[]
[null,null,"Wind farm Definition"]
[]
[null,"Site "]
[]
[null,null,"Location","Select",null,"Land type","Select",null,"Length of new road required (km)"]
[]
[]
[]
[]
[]
[null,"Turbine Selection"]
[]
[null,null,"Turbine","View",null,{"$f":"IF(D16=\"View\",\"Select turbine to view\",D16)","v":"Select turbine to view"},null,null,"Enter number of turbines"]
[null,null,null,null,null,"Power (MW)",{"$f":"IF(D16=\"View\",\"\",HLOOKUP($D$16,Worksheet!$E$51:$J$58,2,FALSE))","v":""},null,"Name ","Number  of turbines"]
[null,null,null,null,null,"Rotor diameter (m)",{"$f":"IF(D16=\"View\",\"\",HLOOKUP($D$16,Worksheet!$E$51:$J$58,3,FALSE))","v":""},null,{"$f":"'Gaia Wind 133 '!C4","v":"Gaia Wind 133 "}]
[null,null,null,null,null,"Rated speed m/s",{"$f":"IF(D16=\"View\",\"\",HLOOKUP($D$16,Worksheet!$E$51:$J$58,4,FALSE))","v":""},null,{"$f":"'Siemens  G2'!C4","v":"Siemens  G2"}]
[null,null,null,null,null,"Design life (Years)",{"$f":"IF(D16=\"View\",\"\",HLOOKUP($D$16,Worksheet!$E$51:$J$58,5,FALSE))","v":""},null,{"$f":"'E- 126'!C4","v":"E- 126"}]
[null,null,null,null,null,"Number of services (Yearly)",{"$f":"IF(D16=\"View\",\"\",HLOOKUP($D$16,Worksheet!$E$51:$J$58,6,FALSE))","v":""}]
[null,null,null,null,null,"Country of Manufacture",{"$f":"IF(D16=\"View\",\"\",HLOOKUP($D$16,Worksheet!$E$51:$J$58,7,FALSE))","v":""}]
[null,null,null,null,null,"Information",{"$f":"IF(D16=\"View\",\"\",HLOOKUP($D$16,Worksheet!$E$51:$J$58,8,FALSE))","v":""}]
[]
[null,null,null,null,null,null,null,null," "]

{"sheet":"Worksheet","index":2,"n_rows":58,"n_cols":31,"rows_kept":58,"cut":false,"hidden":false,"merged":[[8,25,8,29],[5,25,5,30],[29,25,29,26],[33,1,33,2],[30,25,30,29],[28,25,28,26],[25,25,25,30],[9,25,9,30],[10,25,11,25],[5,20,5,23],[6,20,6,22],[9,5,9,6],[14,1,14,2],[30,9,30,17],[9,9,9,18],[7,20,7,22],[1,1,1,3],[1,5,1,30],[24,9,24,18],[26,11,26,12],[27,11,27,12],[4,20,4,22],[12,10,12,12],[12,13,12,15],[21,1,21,2],[8,20,8,22],[9,20,9,22],[4,25,4,29],[6,25,6,29],[26,25,26,26],[27,25,27,26],[7,25,7,29],[28,11,28,12],[25,9,25,13],[12,16,12,18],[4,1,4,3],[8,9,8,17],[6,9,6,17],[7,9,7,17],[5,9,5,18],[4,5,4,6],[4,9,4,17]]}
[]
[null,"Supporting details",null,null,null,"Life cycle stages"]
[]
[null,null,"Worksheet"]
[null," Location Coordinates",null,null,null,"Materials & Manufacture",null,"kgCO2e",null,"Assembly & Installation",null,null,null,null,null,null,null,null,"kgCO2e",null,"Operations & Maintenance",null,null,"kgCO2e",null,"Decommissioning & Disposal",null,null,null,null,"kgCO2e"]
[null,"Coordinates","Latitude","Longitude",null,"Turbine ","Number ",null,null,"Crane CO2 per turbine",null,null,null,null,null,null,null,null,null,null,"Crane CO2 per turbine",null,null,null,null,"Crane CO2 per turbine"]
[null,"Canada- Tillsonburg",42.866700000000002,-80.7333,null,{"$f":"'Gaia Wind 133 '!C4","v":"Gaia Wind 133 "},{"$f":"'Wind farm definition'!J18","v":0},{"$f":"'Gaia Wind 133 '!C45*G7","v":0},null,{"$f":"'Gaia Wind 133 '!C4","v":"Gaia Wind 133 "},null,null,null,null,null,null,null,null,{"$f":"C32*'Gaia Wind 133 '!F11*G7","v":0},null,{"$f":"'Gaia Wind 133 '!C4","v":"Gaia Wind 133 "},null,null,{"$f":"'Gaia Wind 133 '!F12*Worksheet!$C$32*$G$7","v":0},null,{"$f":"'Gaia Wind 133 '!C4","v":"Gaia Wind 133 "},null,null,null,null,{"$f":"'Gaia Wind 133 '!$F$13*Worksheet!C32*Worksheet!$G$7","v":0}]
[null,"China- Shanghai",31.2,121.5,null,{"$f":"'Siemens  G2'!C4","v":"Siemens  G2"},{"$f":"'Wind farm definition'!J19","v":0},{"$f":"'Siemens  G2'!C45*G8","v":0},null,{"$f":"'Siemens  G2'!C4","v":"Siemens  G2"},null,null,null,null,null,null,null,null,{"$f":"C32*'Siemens  G2'!F11*G8","v":0},null,{"$f":"'Siemens  G2'!C4","v":"Siemens  G2"},null,null,{"$f":"'Siemens  G2'!F12*Worksheet!$C$32*$G$8","v":0},null,{"$f":"'Siemens  G2'!C4","v":"Siemens  G2"},null,null,null,null,{"$f":"'Siemens  G2'!$F$13*Worksheet!$C$32*Worksheet!$G$8","v":0}]
[null,"Denmark- Brande",55.95,9.1166999999999998,null,{"$f":"'E- 126'!C4","v":"E- 126"},{"$f":"'Wind farm definition'!J20","v":0},{"$f":"'E- 126'!C45*G9","v":0},null,{"$f":"'E- 126'!C4","v":"E- 126"},null,null,null,null,null,null,null,null,{"$f":"C32*'E- 126'!F11*G9","v":0},null,{"$f":"'E- 126'!C4","v":"E- 126"},null,null,{"$f":"'E- 126'!F12*Worksheet!$C$32*$G$9","v":0},null,{"$f":"'E- 126'!C4","v":"E- 126"},null,null,null,null,{"$f":"'E- 126'!$F$13*Worksheet!$C$32*Worksheet!$G$9","v":0}]
[null,"Kansas- Hutchinson",38.0608,-97.929699999999997,null,"Total ",null,{"$f":"SUM(H7:H9)","v":0},null,"Transport",null,null,null,null,null,null,null,null,null,null,"Total ",null,null,{"$f":"IF(SUM(G7:G9)>=1,SUM(X7:X9)+C31,0)","v":0},null,"Disposal"]
[null,"Portugal- Viana do Castelo\n",41.695,-8.83,null,null,null,null,null,"Site","Latitude","Longitude",null,null,null,null,null,null,null,null,null,null,null,null,null,"Disposal process","CO2 from process"]
[null,"UK- Glasgow ",55.857999999999997,-4.2590000000000003,null,null,null,null,null,{"$f":"IF('Wind farm definition'!$D$8=Worksheet!$B$13,'Wind farm definition'!$C$12,'Wind farm definition'!$D$8)","v":0},{"$f":"IF('Wind farm definition'!$D$8=Worksheet!$B$13,'Wind farm definition'!$D$12,LOOKUP('Wind farm definition'!$D$8,Worksheet!$B$7:$B$14,Worksheet!$C$7:$C$14))","v":0},{"$f":"IF('Wind farm definition'!$D$8=Worksheet!$B$13,'Wind farm definition'!$E$12,LOOKUP('Wind farm definition'!D8,Worksheet!B7:B14,Worksheet!D7:D18))","v":0},null,null,null,null,null,null,null,null,null,null,null,null,null,null,"kgCO2e/kg"]
[null,"Select",null,null,null,null,null,null,null,null,{"$f":"'Gaia Wind 133 '!C4","v":"Gaia Wind 133 "},null,null,{"$f":"'Siemens  G2'!C4","v":"Siemens  G2"},null,null,{"$f":"'E- 126'!C4","v":"E- 126"},null,null,null,null,null,null,null,null,"Incineration  ",0.15740000000000001]
[null,null,null,null,null,null,null,null,null,"Structure part ","Distance (km)","Transport","kgCO2e","Distance (km)","Transport","kgCO2e","Distance (km)","Transport","kgCO2e",null,null,null,null,null,null,"Landfill ",0]
[null,"Land",null,null,null,null,null,null,null,"Gearbox",{"$f":"ACOS(SIN($K$12)*SIN('Gaia Wind 133 '!$D32)+COS(Worksheet!$K$12)*COS('Gaia Wind 133 '!$D32)*COS('Gaia Wind 133 '!$E32-Worksheet!$L$12))*6371","v":6343.2055341077375},"Select ",{"$f":"IF(SUM($G$7:$G$9)>=1,('Gaia Wind 133 '!D18/1000)*K15*$G$7*LOOKUP(L15,$B$24:$B$26,$C$24:$C$26),0)","v":0},{"$f":"ACOS(SIN($K$12)*SIN('Siemens  G2'!$D32)+COS($K$12)*COS('Siemens  G2'!$D32)*COS('Siemens  G2'!$E32-$L$12))*6371","v":15937.24367574908},"Select ",{"$f":"IF(SUM($G$7:$G$9)>=1,('Siemens  G2'!D18/1000)*N15*$G$8*LOOKUP(O15,$B$24:$B$26,$C$24:$C$26),0)","v":0},{"$f":"ACOS(SIN($K$12)*SIN('E- 126'!$D32)+COS($K$12)*COS('E- 126'!$D32)*COS('E- 126'!$E32-$L$12))*6371","v":15937.24367574908},"Select ",{"$f":"IF(SUM($G$7:$G$9)>=1,('E- 126'!A18/1000)*Q15*$G$9*LOOKUP(R15,$B$24:$B$26,$C$24:$C$26),0)","v":0},null,null,null,null,null,null,"Recycle",0]
[null,"Type of Land","Coefficient",null,null,null,null,null,null,"Chassis",{"$f":"ACOS(SIN($K$12)*SIN('Gaia Wind 133 '!$D33)+COS(Worksheet!$K$12)*COS('Gaia Wind 133 '!$D33)*COS('Gaia Wind 133 '!$E33-Worksheet!$L$12))*6371","v":6343.2055341077375},"Select ",{"$f":"IF(SUM($G$7:$G$9)>=1,('Gaia Wind 133 '!D19/1000)*K16*$G$7*LOOKUP(L16,$B$24:$B$26,$C$24:$C$26),0)","v":0},{"$f":"ACOS(SIN($K$12)*SIN('Siemens  G2'!$D33)+COS($K$12)*COS('Siemens  G2'!$D33)*COS('Siemens  G2'!$E33-$L$12))*6371","v":15781.228653338876},"Select ",{"$f":"IF(SUM($G$7:$G$9)>=1,('Siemens  G2'!D19/1000)*N16*$G$8*LOOKUP(O16,$B$24:$B$26,$C$24:$C$26),0)","v":0},{"$f":"ACOS(SIN($K$12)*SIN('E- 126'!$D33)+COS($K$12)*COS('E- 126'!$D33)*COS('E- 126'!$E33-$L$12))*6371","v":15937.24367574908},"Select ",{"$f":"IF(SUM($G$7:$G$9)>=1,('E- 126'!A19/1000)*Q16*$G$9*LOOKUP(R16,$B$24:$B$26,$C$24:$C$26),0)","v":0},null,null,null,null,null,null,"Turbine part","Option","Total mass (kg)"]
[null,"Agricultural Land",1,null,null,null,null,null,null,"Generator",{"$f":"ACOS(SIN($K$12)*SIN('Gaia Wind 133 '!$D34)+COS(Worksheet!$K$12)*COS('Gaia Wind 133 '!$D34)*COS('Gaia Wind 133 '!$E34-Worksheet!$L$12))*6371","v":6343.2055341077375},"Select ",{"$f":"IF(SUM($G$7:$G$9)>=1,('Gaia Wind 133 '!D20/1000)*K17*$G$7*LOOKUP(L17,$B$24:$B$26,$C$24:$C$26),0)","v":0},{"$f":"ACOS(SIN($K$12)*SIN('Siemens  G2'!$D34)+COS($K$12)*COS('Siemens  G2'!$D34)*COS('Siemens  G2'!$E34-$L$12))*6371","v":15937.24367574908},"Select ",{"$f":"IF(SUM($G$7:$G$9)>=1,('Siemens  G2'!D20/1000)*N17*$G$8*LOOKUP(O17,$B$24:$B$26,$C$24:$C$26),0)","v":0},{"$f":"ACOS(SIN($K$12)*SIN('E- 126'!$D34)+COS($K$12)*COS('E- 126'!$D34)*COS('E- 126'!$E34-$L$12))*6371","v":15937.24367574908},"Select ",{"$f":"IF(SUM($G$7:$G$9)>=1,('E- 126'!A20/1000)*Q17*$G$9*LOOKUP(R17,$B$24:$B$26,$C$24:$C$26),0)","v":0},null,null,null,null,null,null,"Gearbox","Landfill ",{"$f":"('Gaia Wind 133 '!D18*$G$7)+('Siemens  G2'!D18*$G$8)+('E- 126'!D18*$G$9)","v":0},null,null,{"$f":"(LOOKUP(AA17,$Z$13:$Z$15,$AA$13:$AA$15)*AB17)+AC17","v":0}]
[null,"Industrial Site",0,null,null,null,null,null,null,"Cover",{"$f":"ACOS(SIN($K$12)*SIN('Gaia Wind 133 '!$D35)+COS(Worksheet!$K$12)*COS('Gaia Wind 133 '!$D35)*COS('Gaia Wind 133 '!$E35-Worksheet!$L$12))*6371","v":6343.2055341077375},"Select ",{"$f":"IF(SUM($G$7:$G$9)>=1,('Gaia Wind 133 '!D21/1000)*K18*$G$7*LOOKUP(L18,$B$24:$B$26,$C$24:$C$26),0)","v":0},{"$f":"ACOS(SIN($K$12)*SIN('Siemens  G2'!$D35)+COS($K$12)*COS('Siemens  G2'!$D35)*COS('Siemens  G2'!$E35-$L$12))*6371","v":15781.228653338876},"Select ",{"$f":"IF(SUM($G$7:$G$9)>=1,('Siemens  G2'!D21/1000)*N18*$G$8*LOOKUP(O18,$B$24:$B$26,$C$24:$C$26),0)","v":0},{"$f":"ACOS(SIN($K$12)*SIN('E- 126'!$D35)+COS($K$12)*COS('E- 126'!$D35)*COS('E- 126'!$E35-$L$12))*6371","v":15937.24367574908},"Select ",{"$f":"IF(SUM($G$7:$G$9)>=1,('E- 126'!A21/1000)*Q18*$G$9*LOOKUP(R18,$B$24:$B$26,$C$24:$C$26),0)","v":0},null,null,null,null,null,null,"Chassis","Landfill ",{"$f":"('Gaia Wind 133 '!D19*$G$7)+('Siemens  G2'!D19*$G$8)+('E- 126'!D19*$G$9)","v":0},null,null,{"$f":"(LOOKUP(AA18,$Z$13:$Z$15,$AA$13:$AA$15)*AB18)+AC18","v":0}]
[null,"Moorland",{"$f":"AVERAGE('Gaia Wind 133 '!C10+'Siemens  G2'!C10+'E- 126'!C10)*0.92*0.001","v":5.5200000000000006E-2},null,null,null,null,null,null,"Blade",{"$f":"ACOS(SIN($K$12)*SIN('Gaia Wind 133 '!$D36)+COS(Worksheet!$K$12)*COS('Gaia Wind 133 '!$D36)*COS('Gaia Wind 133 '!$E36-Worksheet!$L$12))*6371","v":6343.2055341077375},"Select ",{"$f":"IF(SUM($G$7:$G$9)>=1,('Gaia Wind 133 '!D22/1000)*K19*$G$7*LOOKUP(L19,$B$24:$B$26,$C$24:$C$26),0)","v":0},{"$f":"ACOS(SIN($K$12)*SIN('Siemens  G2'!$D36)+COS($K$12)*COS('Siemens  G2'!$D36)*COS('Siemens  G2'!$E36-$L$12))*6371","v":8355.5191526123763},"Select ",{"$f":"IF(SUM($G$7:$G$9)>=1,('Siemens  G2'!D22/1000)*N19*$G$8*LOOKUP(O19,$B$24:$B$26,$C$24:$C$26),0)","v":0},{"$f":"ACOS(SIN($K$12)*SIN('E- 126'!$D36)+COS($K$12)*COS('E- 126'!$D36)*COS('E- 126'!$E36-$L$12))*6371","v":15937.24367574908},"Select ",{"$f":"IF(SUM($G$7:$G$9)>=1,('E- 126'!A22/1000)*Q19*$G$9*LOOKUP(R19,$B$24:$B$26,$C$24:$C$26),0)","v":0},null,null,null,null,null,null,"Generator","Landfill ",{"$f":"('Gaia Wind 133 '!D20*$G$7)+('Siemens  G2'!D20*$G$8)+('E- 126'!D20*$G$9)","v":0},null,null,0]
[null,"Select",null,null,null,null,null,null,null,"Tower",{"$f":"ACOS(SIN($K$12)*SIN('Gaia Wind 133 '!$D37)+COS(Worksheet!$K$12)*COS('Gaia Wind 133 '!$D37)*COS('Gaia Wind 133 '!$E37-Worksheet!$L$12))*6371","v":6343.2055341077375},"Select ",{"$f":"IF(SUM($G$7:$G$9)>=1,('Gaia Wind 133 '!D23/1000)*K20*$G$7*LOOKUP(L20,$B$24:$B$26,$C$24:$C$26),0)","v":0},{"$f":"ACOS(SIN($K$12)*SIN('Siemens  G2'!$D37)+COS($K$12)*COS('Siemens  G2'!$D37)*COS('Siemens  G2'!$E37-$L$12))*6371","v":15781.228653338876},"Select ",{"$f":"IF(SUM($G$7:$G$9)>=1,('Siemens  G2'!D23/1000)*N20*$G$8*LOOKUP(O20,$B$24:$B$26,$C$24:$C$26),0)","v":0},{"$f":"ACOS(SIN($K$12)*SIN('E- 126'!$D37)+COS($K$12)*COS('E- 126'!$D37)*COS('E- 126'!$E37-$L$12))*6371","v":15937.24367574908},"Select ",{"$f":"IF(SUM($G$7:$G$9)>=1,('E- 126'!A23/1000)*Q20*$G$9*LOOKUP(R20,$B$24:$B$26,$C$24:$C$26),0)","v":0},null,null,null,null,null,null,"Cover","Incineration  ",{"$f":"('Gaia Wind 133 '!D21*$G$7)+('Siemens  G2'!D21*$G$8)+('E- 126'!D21*$G$9)","v":0},null,null,0]
[null,null,null,null,null,null,null,null,null,"Base",{"$f":"ACOS(SIN($K$12)*SIN('Gaia Wind 133 '!$D38)+COS(Worksheet!$K$12)*COS('Gaia Wind 133 '!$D38)*COS('Gaia Wind 133 '!$E38-Worksheet!$L$12))*6371","v":6343.2055341077375},"Select ",{"$f":"IF(SUM($G$7:$G$9)>=1,('Gaia Wind 133 '!D25/1000)*K21*$G$7*LOOKUP(L21,$B$24:$B$26,$C$24:$C$26),0)","v":0},{"$f":"ACOS(SIN($K$12)*SIN('Siemens  G2'!$D38)+COS($K$12)*COS('Siemens  G2'!$D38)*COS('Siemens  G2'!$E38-$L$12))*6371","v":15781.228653338876},"Select ",{"$f":"IF(SUM($G$7:$G$9)>=1,('Siemens  G2'!D25/1000)*N21*$G$8*LOOKUP(O21,$B$24:$B$26,$C$24:$C$26),0)","v":0},{"$f":"ACOS(SIN($K$12)*SIN('E- 126'!$D38)+COS($K$12)*COS('E- 126'!$D38)*COS('E- 126'!$E38-$L$12))*6371","v":15937.24367574908},"Select ",{"$f":"IF(SUM($G$7:$G$9)>=1,('E- 126'!A25/1000)*Q21*$G$9*LOOKUP(R21,$B$24:$B$26,$C$24:$C$26),0)","v":0},null,null,null,null,null,null,"Blade","Incineration  ",{"$f":"('Gaia Wind 133 '!D22*$G$7)+('Siemens  G2'!D22*$G$8)+('E- 126'!D22*$G$9)","v":0},null,null,0]
[null,"Transport",null,null,null,null,null,null,null,"Rebar",{"$f":"ACOS(SIN($K$12)*SIN('Gaia Wind 133 '!$D39)+COS(Worksheet!$K$12)*COS('Gaia Wind 133 '!$D39)*COS('Gaia Wind 133 '!$E39-Worksheet!$L$12))*6371","v":6343.2055341077375},"Select ",{"$f":"IF(SUM($G$7:$G$9)>=1,('Gaia Wind 133 '!D26/1000)*K22*$G$7*LOOKUP(L22,$B$24:$B$26,$C$24:$C$26),0)","v":0},{"$f":"ACOS(SIN($K$12)*SIN('Siemens  G2'!$D39)+COS($K$12)*COS('Siemens  G2'!$D39)*COS('Siemens  G2'!$E39-$L$12))*6371","v":15781.228653338876},"Select ",{"$f":"IF(SUM($G$7:$G$9)>=1,('Siemens  G2'!D26/1000)*N22*$G$8*LOOKUP(O22,$B$24:$B$26,$C$24:$C$26),0)","v":0},{"$f":"ACOS(SIN($K$12)*SIN('E- 126'!$D39)+COS($K$12)*COS('E- 126'!$D39)*COS('E- 126'!$E39-$L$12))*6371","v":15937.24367574908},"Select ",{"$f":"IF(SUM($G$7:$G$9)>=1,('E- 126'!A26/1000)*Q22*$G$9*LOOKUP(R22,$B$24:$B$26,$C$24:$C$26),0)","v":0},null,null,null,null,null,null,"Tower","Recycle",{"$f":"('Gaia Wind 133 '!D23*$G$7)+('Siemens  G2'!D23*$G$8)+('E- 126'!D23*$G$9)","v":0},null,null,0]
[null,"Mode of Transport","kgCO2e/ton of freight/km",null,null,null,null,null,null,"Cable",{"$f":"ACOS(SIN($K$12)*SIN('Gaia Wind 133 '!$D40)+COS(Worksheet!$K$12)*COS('Gaia Wind 133 '!$D40)*COS('Gaia Wind 133 '!$E40-Worksheet!$L$12))*6371","v":6343.2055341077375},"Select ",{"$f":"IF(SUM($G$7:$G$9)>=1,('Gaia Wind 133 '!D27/1000)*K23*$G$7*LOOKUP(L23,$B$24:$B$26,$C$24:$C$26),0)","v":0},{"$f":"ACOS(SIN($K$12)*SIN('Siemens  G2'!$D40)+COS($K$12)*COS('Siemens  G2'!$D40)*COS('Siemens  G2'!$E40-$L$12))*6371","v":15781.228653338876},"Select ",{"$f":"IF(SUM($G$7:$G$9)>=1,('Siemens  G2'!D27/1000)*N23*$G$8*LOOKUP(O23,$B$24:$B$26,$C$24:$C$26),0)","v":0},{"$f":"ACOS(SIN($K$12)*SIN('E- 126'!$D40)+COS($K$12)*COS('E- 126'!$D40)*COS('E- 126'!$E40-$L$12))*6371","v":15937.24367574908},"Select ",{"$f":"IF(SUM($G$7:$G$9)>=1,('E- 126'!A27/1000)*Q23*$G$9*LOOKUP(R23,$B$24:$B$26,$C$24:$C$26),0)","v":0},null,null,null,null,null,null,"Base","Recycle",{"$f":"('Gaia Wind 133 '!D25*$G$7)+('Siemens  G2'!D25*$G$8)+('E- 126'!D25*$G$9)","v":0},null,null,0]
[null,"Lorry ",0.15,null,null,null,null,null,null,"Total Transport",null,null,null,null,null,null,null,null,{"$f":"SUM(P15:P23)+SUM(M15:M23)+SUM(S15:S23)","v":0},null,null,null,null,null,null,"Rebar","Recycle",{"$f":"('Gaia Wind 133 '!D26*$G$7)+('Siemens  G2'!D26*$G$8)+('E- 126'!D26*$G$9)","v":0},null,null,0]
[null,"Plane",0.5,null,null,null,null,null,null,"Road",null,null,null,null,null,null,null,null,null,null,null,null,null,null,null,"Cable","Recycle",{"$f":"('Gaia Wind 133 '!D27*$G$7)+('Siemens  G2'!D27*$G$8)+('E- 126'!D27*$G$9)","v":0},null,null,0]
[null,"Ship ",0.04,null,null,null,null,null,null,"Details ",null,null,null,null,null,null,null,null,null,null,null,null,null,null,null,"Travel "]
[null,"Select ",null,null,null,null,null,null,null,"Width (m)",12.192,"Density of concrete kg/m^3",null,2400,null,null,null,null,null,null,null,null,null,null,null,"Disposal Process",null,"Distance travelled (km)","Transport","Mass (kg)"]
[null,"Crane details",null,null,null,null,null,null,null,"Depth (m)",0.25,"Concrete kgCO2e/kg ",null,0.47,null,null,null,null,null,null,null,null,null,null,null,"Landfill ",null,50,"Lorry ",{"$f":"IF($Z28=$AA$17,$AB$17,0)+IF($Z28=$AA$18,$AB$18,0)+IF($Z28=$AA$19,$AB$19,0)+IF($Z28=$AA$20,$AB$20,0)+IF($Z28=$AA$21,$AB$21,0)+IF($Z28=$AA$22,$AB$22,0)+IF($Z28=$AA$23,AB$23,0)+IF($Z28=$AA$24,$AB$24,0)+IF($Z28=$AA$25,$AB$25,0)","v":0},{"$f":"IF(SUM(G7:G9)>=1,LOOKUP(AC28,$B$24:$B$26,$C$24:$C$26)*AB28*AD28/1000,0)","v":0}]
[null,"Distance to site (km)",50,null,null,null,null,null,null,"Volume (m^3)",{"$f":"($K$27)*($K$28)*'Wind farm definition'!$J$8*1000","v":0},"Road kgCO2e",null,{"$f":"IF('Wind farm definition'!$G$8=\"Industrial Site\",0,$N28*$K30)","v":0},null,null,null,null,null,null,null,null,null,null,null,"Recycle",null,100,"Lorry ",{"$f":"IF($Z29=$AA$17,$AB$17,0)+IF($Z29=$AA$18,$AB$18,0)+IF($Z29=$AA$19,$AB$19,0)+IF($Z29=$AA$20,$AB$20,0)+IF($Z29=$AA$21,$AB$21,0)+IF($Z29=$AA$22,$AB$22,0)+IF($Z29=$AA$23,AB$23,0)+IF($Z29=$AA$24,$AB$24,0)+IF($Z29=$AA$25,$AB$25,0)","v":0},{"$f":"IF(SUM(G7:G9)>=1,LOOKUP(AC29,$B$24:$B$26,$C$24:$C$26)*AB29*AD29/1000,0)","v":0}]
[null,"Freight weight of crane (kg)",51000,null,null,null,null,null,null,"Mass (kg)",{"$f":"K29*$N$27","v":0},"Land type kgCO2e",null,{"$f":"(LOOKUP('Wind farm definition'!$G$8,Worksheet!B17:B19,Worksheet!C17:C19))*$N$29","v":0},null,null,null,null,{"$f":"N29+N30","v":0},null,null,null,null,null,null,"Incineration  ",null,50,"Lorry ",0,{"$f":"IF(SUM(G7:G9)>=1,LOOKUP(AC30,$B$24:$B$26,$C$24:$C$26)*AB30*AD30/1000,0)","v":0}]
{"$rows_left_out":29}
{"sheet":"Carbon appraisal result","index":3,"n_rows":39,"n_cols":9,"rows_kept":39,"cut":false,"hidden":false,"merged":[[0,1,0,13],[31,6,31,7],[27,5,27,8]]}
[null,"Carbon appraisal"]
[null,null,"Carbon Appraisal Result"]
[]
[]
[]
[]
[]
[]
[]
[]
[]
[]
[]
[]
[]
[]
[]
[]
[]
[]
[]
[]
[]
[]
[]
[]
[]
[null,null,null,null,null,"Summary (kgCO2e)"]
[null,null,null,null,null,{"$f":"Worksheet!F5","v":"Materials & Manufacture"},{"$f":"Worksheet!J5","v":"Assembly & Installation"},{"$f":"Worksheet!U5","v":"Operations & Maintenance"},{"$f":"Worksheet!Z5","v":"Decommissioning & Disposal"}]
[null,null,null,null,null,{"$f":"Worksheet!H10","v":0},{"$f":"Worksheet!S31","v":0},{"$f":"Worksheet!X10","v":0},{"$f":"Worksheet!AE31","v":0}]
{"$rows_left_out":10}
{"sheet":"Gaia Wind 133 ","index":4,"n_rows":54,"n_cols":6,"rows_kept":54,"cut":false,"hidden":false,"merged":[[46,1,46,5],[41,1,41,5],[3,4,3,5],[1,1,1,5],[14,1,14,5],[23,1,23,5],[28,1,28,5]]}
[]
[null,{"$f":"C4","v":"Gaia Wind 133 "}]
[]
[null,null,"Gaia Wind 133 ",null,"Additional Information "]
[null,"Power (MW)",1.0999999999999999E-2,null,"IEC Class ","III (means suitable for sites with an annual average wind speed up to 7.5m/s)"]
[null,"Rotor diameter (m)",13,null,"Cut in wind speed (m/s)",3.5]
[null,"Rated speed (m/s)",10,null,"Cut out wind speed (m/s)",25]
[null,"Power coefficient",0.42,null,"Blade length ",{"$f":"C6/2","v":6.5}]
[null,"Yearly energy production (MWh)",{"$f":"D54/1000000","v":62.328767941439985},null,"Swept area (m^2)",{"$f":"POWER(C6,2)*0.25*3.14","v":132.66499999999999}]
[null,"Design life (Years)",20,null,"Tower height (m)",18.3]
[null,"Number of services (Yearly)",1,null,"Hours equipment in use for turbine construction ",12]
[null,"Country of Manufacture","UK",null,"Hours equipment in use for turbine maintenance",6]
[null,"Information","http://www.gaia-wind.com/133-11kw-turbine/",null,"Hours equipment in use for turbine decommission",12]
[]
[null,"Embodied CO2 of Materials Manufacture"]
[]
[null," Turbine part","Typical Material","Typical Weight (kg)","kgCO2e/kg","kgCO2e"]
[null,"Gearbox","Steel",75,0.47,{"$f":"D18*E18","v":35.25}]
[null,"Chassis","Steel",590,0.47,{"$f":"D19*E19","v":277.3}]
[null,"Generator","Copper",150,2.71,406.5]
[null,"Cover","Fibreglass",10,1.54,15.4]
[null,"Blade","Fibreglass",200,1.54,308]
[null,"Tower","Steel",2300,0.47,1081]
[null,"Foundation"]
[null,"Base","Concrete",49500,0.47,{"$f":"D25*E25","v":23265}]
[null,"Rebar","Steel",810,0.47,{"$f":"D26*E26","v":380.7}]
[null,"Cable","Copper",572,2.71,1550.12]
[]
[null,"Manufacturer "]
[]
{"$rows_left_out":25}
{"sheet":"Siemens  G2","index":5,"n_rows":54,"n_cols":6,"rows_kept":54,"cut":false,"hidden":false,"merged":[[46,1,46,5],[41,1,41,5],[1,1,1,5],[3,4,3,5],[14,1,14,5],[23,1,23,5],[28,1,28,5]]}
[]
[null,{"$f":"C4","v":"Siemens  G2"}]
[]
[null,"Name of turbine","Siemens  G2",null,"Additional Information "]
[null,"Power (MW)",2.2999999999999998,null,"IEC Class ","IIB  (means suitable for sites with an annual average wind speed up to 8.5m/s)"]
[null,"Rotor diameter (m)",101,null,"Cut in wind speed (m/s)",3.5]
[null,"Rated speed m/s",12.5,null,"Cut out wind speed (m/s)",25]
[null,"Power coefficient",0.3,null,"Blade length ",49]
[null,"Yearly energy production (MWh)",{"$f":"D54/1000000","v":3437.6123743830012},null,"Swept area (m^2)",{"$f":"POWER(C6,2)*0.25*3.14","v":8007.7850000000008}]
[null,"Design life (Years)",20,null,"Hub height (m)","80 or site specific"]
[null,"Number of services (Yearly)",1,null,"Hours equipment in use for turbine construction ",24]
[null,"Country of Manufacture","Denmark",null,"Hours equipment in use for turbine maintenance",6]
[null,"Information","http://www.energy.siemens.com/nl/en/renewable-energy/wind-power/platforms/g2-platform/",null,"Hours equipment in use for turbine decommission",24]
[]
[null,"Embodied CO2 of Materials Manufacture"]
[]
[null,"Turbine part","Typical Material","Typical Weight (kg)","kgCO2e/kg","kgCO2e"]
[null,"Gearbox","Steel",112.5,0.47,{"$f":"D18*E18","v":52.875}]
[null,"Chassis","Steel",4583.8461538461534,0.47,{"$f":"D19*E19","v":2154.4076923076918}]
[null,"Generator","Copper",1165.3846153846155,2.71,3158.1923076923081]
[null,"Cover","Fibreglass",15,1.54,23.1]
[null,"Blade","Fibreglass",1553.8461538461538,1.54,2392.9230769230771]
[null,"Tower","Steel",162000,0.47,76140]
[null,"Foundation"]
[null,"Base","Concrete",384576.92307692306,0.47,{"$f":"D25*E25","v":180751.15384615384}]
[null,"Rebar","Steel",6293.0769230769229,0.47,{"$f":"D26*E26","v":2957.7461538461534}]
[null,"Cable","Copper",4444,2.71,12043.24]
[]
[null,"Manufacturer "]
[]
{"$rows_left_out":25}
{"sheet":"E- 126","index":6,"n_rows":54,"n_cols":6,"rows_kept":54,"cut":false,"hidden":false,"merged":[[46,1,46,5],[41,1,41,5],[1,1,1,5],[3,4,3,5],[14,1,14,5],[23,1,23,5],[28,1,28,5]]}
[]
[null,{"$f":"C4","v":"E- 126"}]
[]
[null,"Name of turbine","E- 126",null,"Additional Information "]
[null,"Power (MW)",7.58,null,"IEC Class ","IA  (means suitable for sites with an annual average wind speed up to 10m/s)"]
[null,"Rotor diameter (m)",127,null,"Cut in wind speed (m/s)",3]
[null,"Rated speed m/s",10,null,"Cut out wind speed (m/s)",34]
[null,"Power coefficient",0.19900000000000001,null,"Blade length "]
[null,"Yearly energy production (MWh)",{"$f":"D54/1000000","v":3046.9674984894714},null,"Swept area (m^2)",{"$f":"POWER(C6,2)*0.25*3.14","v":12661.265000000001}]
[null,"Design life (Years)",20,null,"Hub height (m)",135]
[null,"Number of services (Yearly)",1,null,"Hours equipment in use for turbine construction ",30]
[null,"Country of Manufacture","Portugal",null,"Hours equipment in use for turbine maintenance",6]
[null,"Information","http://www.enercon.de/en-en/66.htm",null,"Hours equipment in use for turbine decommission",30]
[]
[null,"Embodied CO2 of Materials Manufacture"]
[]
[null,"Turbine part","Typical Material","Typical Weight (kg)","kgCO2e/kg","kgCO2e"]
[null,"Gearbox","Steel",150,0.47,{"$f":"D18*E18","v":70.5}]
[null,"Chassis","Steel",128000,0.47,{"$f":"D19*E19","v":60160}]
[null,"Generator","Copper",220000,2.71,596200]
[null,"Cover","Fibreglass",20,1.54,30.8]
[null,"Blade","Fibreglass",364000,1.54,560560]
[null,"Tower","Concrete",22469.23076923077,0.47,10560.538461538461]
[null,"Foundation"]
[null,"Base","Concrete",2500000,0.47,{"$f":"D25*E25","v":1175000}]
[null,"Rebar","Steel",7913.0769230769238,0.47,{"$f":"D26*E26","v":3719.146153846154}]
[null,"Cable","Copper",5588.0000000000009,2.71,15143.480000000001]
[]
[null,"Manufacturer "]
[]
{"$rows_left_out":24}